LIQUID WATER EQUIVALENT
type: Concept
change note: 2014-04-14 16:22:54.0 [128.183.164.42] updated definition update Definition (The liquid content of solid precipitation that has accumulated on the ground (snow depth). The accumulation may consist of snow, ice formed by freezing precipitation, freezing liquid precipitation, or ice formed by the refreezing of melted snow.); update Definition (National Weather Service Glossary, NOAA, 2009);
in scheme: sciencekeywords
definition: The liquid content of solid precipitation that has accumulated on the ground (snow depth). The accumulation may consist of snow, ice formed by freezing precipitation, freezing liquid precipitation, or ice formed by the refreezing of melted snow.

PRECIPITATION
type: Concept