COLOSTATE/WCNR/DG
type: Concept
in scheme: providers
definition: Our program permits individual attention and strong student-professor interaction. Classes are made interactive by field trips, visiting speakers, and informal career discussions. Summary Provided By: http://welcome.warnercnr.colostate.edu/geosciences-home/index.php

ACADEMIC
type: Concept