MARINE DEBRIS REMOVAL
type: Concept
change note: 2021-08-05 15:56:38.0 [tstevens] insert Definition (id: null text: Refers to the collection and removal of debris from the Ocean. language code: en);
change note: 2021-08-05 15:51:16.0 [tstevens] Insert Concept add broader relation (MARINE DEBRIS REMOVAL [ed96cfbb-6fc5-4f02-baba-4c37b813c259,692293] - ENVIRONMENTAL IMPACTS [3f4cfc81-7745-43d9-b313-f68cdf72359b,689102]);
in scheme: sciencekeywords
definition: Refers to the collection and removal of debris from the Ocean.

ENVIRONMENTAL IMPACTS
type: Concept