SI/STRI/MESP
type: Concept
in scheme: providers
definition: The Marine Environmental Sciences Program (MESP) monitors a variety of physical and biological parameters on the Atlantic and Pacific coasts of Panama. This monitoring is designed to reveal local long-term changes in the environment as well as to provide background data to support the STRI field stations and other marine research. Website: "http://www.stri.org/mesp/MESP.htm" [Summary provided by the MESP.]

CONSORTIA/INSTITUTIONS
type: Concept