MULTINATIONAL ORGANIZATIONS
type: Concept

UNEP/GRID-GENEVA
type: Concept
change note: 2021-06-21 08:38:01.0 [tstevens] Insert Concept add broader relation (UNEP/GRID-GENEVA [edcb6f5d-1065-4c4b-8c66-c2850ca118e3,649563] - MULTINATIONAL ORGANIZATIONS [756a90f8-4203-46f1-87e9-9e0d64bdee50,636089]);
in scheme: providers
definition: GRID-Geneva is part of the Science Division of the UN Environment Programme's global group of environmental information centres, known as the Global Resource Information Database (GRID) network. GRIDs-Geneva and Nairobi were the first centres to be launched in mid-1985.