CRYOSPHERIC INDICATORS
type: Concept

SALINITY
type: Concept
change note: 2012-07-10 15:41:51.0 [mpmorahan] insert Definition (id: null text: How salty the water is. Brine has a very high salinity. Fresh water has a salinity of zero. language code: en);
change note: 2012-06-26 13:37:40.0 [gee-cee] Insert Concept add broader relation (SALINITY [ee0fce70-2097-4f5b-853a-c34e6cbff929,39933] - CRYOSPHERIC INDICATORS [76b8c21c-c221-4724-86ef-c07222cb152b,39899]);
in scheme: sciencekeywords
definition: How salty the water is. Brine has a very high salinity. Fresh water has a salinity of zero.