YEASTS/TRUFFLES
type: Concept
in scheme: sciencekeywords
definition: Yeasts are members of the Ascomycota Division. Yeasts are unicellular and they reproduce asexually by budding.

FUNGI
type: Concept