CLEMSON/HORT
type: Concept
in scheme: providers
definition: The mission of the Clemson University Department of Horticulture is to promote personal and professional growth through the discovery, communication, and application of horticultural experiences, knowledge, and scholarship. Our work fosters environmental stewardship while improving economic wellbeing, health, and quality of life for all. Website: "http://www.clemson.edu/hort/" [Summary provided by Clemson University.]

ACADEMIC
type: Concept