Profilers/Sounders
type: Concept

WIND PROFILERS
type: Concept
change note: 2021-08-05 18:03:28.0 [sritz] insert AltLabel (id: null category: primary text: WIND PROFILERS language code: en);
in scheme: instruments
definition: WIND PROFILERS are radars that are used to measure vertical profiles of the wind; also called wind profiler radar.