FAIR WEATHER CUMULUS
type: Concept
change note: 2017-03-16 10:19:56.0 [sritz] insert Definition (id: null text: A species of cumulus characterized by small vertical development, uniform flat bases and a general similarity among clouds. language code: en);
change note: 2013-02-14 09:47:12.0 [mpmorahan] Insert Concept add broader relation (FAIR WEATHER CUMULUS [ef4de9ce-01ee-4bf0-8814-abefd1bad4b9,82219] - CUMULUS HUMILIS [6aa7422c-ad66-40b6-90cd-750f9158daee,82217]);
in scheme: sciencekeywords
definition: A species of cumulus characterized by small vertical development, uniform flat bases and a general similarity among clouds.

CUMULUS HUMILIS
type: Concept