NAGOYA-U/STELAB
type: Concept
in scheme: providers
definition: The Solar-Terrestrial Environment Laboratory is operated under an inter-university collaborative system in Japan for conducting and promoting comprehensive research on the solar-terrestrial environment. Website: "http://www.stelab.nagoya-u.ac.jp/" [Summary provided by Nagoya University.]

ACADEMIC
type: Concept