A - C
type: Concept

CARAFE
type: Concept
change note: 2021-06-29 09:48:32.0 [sritz] insert AltLabel (id: null category: primary text: CARbon Atmosphere Flux Experiment language code: en);
change note: 2021-06-29 09:47:37.0 [sritz] Insert Concept add broader relation (CARAFE [efcad04c-9e9c-42ad-be9b-a670f7454a2a,663807] - A - C [0c89f3f4-7ab1-43ce-89ee-795d35f0e30a,657007]);
change note: 2021-06-29 09:50:28.0 [sritz] insert Definition (id: null text: Objectives Assemble a versatile, economical system for measuring airborne fluxes Quantify greenhouse gas (GHG) sources/sinks over a spectrum of ecosystems Evaluate biophysical process models and parameterizations Validate top-level satellite flux products from OCO-2 and other missions language code: en);
in scheme: projects
definition: Objectives Assemble a versatile, economical system for measuring airborne fluxes Quantify greenhouse gas (GHG) sources/sinks over a spectrum of ecosystems Evaluate biophysical process models and parameterizations Validate top-level satellite flux products from OCO-2 and other missions