OV-103
type: Concept
change note: 2021-11-30 12:15:03.0 [tstevens] Move Concepts delete broader relation (null); add broader relation (OV-103 [f03dc3d3-f280-4ff4-b0e6-de800bb21ebb,826890] - Space Stations/Crewed Spacecraft [388e72a1-b851-4b78-9e69-747e06ae215f,826132]);
change note: 2021-11-30 12:27:48.0 [tstevens] Move Concepts delete broader relation (null); add broader relation (OV-103 [f03dc3d3-f280-4ff4-b0e6-de800bb21ebb,826890] - SPACE SHUTTLE [3ef93fbf-1e19-42a9-a91f-502d125dbb7c,826168]);
change note: 2021-11-30 12:09:17.0 [tstevens] Move Concepts delete broader relation (null); add broader relation (OV-103 [f03dc3d3-f280-4ff4-b0e6-de800bb21ebb,826890] - Space-based Platforms [b39a69b4-c3b9-4a94-b296-bbbbe5e4c847,835875]);
definition: The Space Shuttle Discover was the the third orbiter to become operational at Kennedy Space Center, was named after one of two ships that were used by the British explorer James Cook in the 1770s during voyages in the South Pacific that led to the discovery of the Hawaiian Islands. Another of his ships was the Endeavour, the namesake of NASA's newest orbiter. Discovery benefited from lessons learned in the construction and testing of Enterprise, Columbia and Challenger. At rollout, its weight was some 6,870 pounds less than Columbia. Two orbiters, Challenger and Discovery, were modified at KSC to enable them to carry the Centaur upper stage in the payload bay. These modifications included extra plumbing to load and vent Centaur's cryogenic (L02/LH2) propellants (other IUS/PAM upper stages use solid propellants), and controls on the aft flight deck for loading and monitoring the Centaur stage. No Centaur flight was ever flown and after the loss of Challenger it was decided that the risk was too great to launch a shuttle with a fueled Centaur upper stage in the payload bay. [Summary provided by NASA] Group: Platform_Details Entry_ID: OV-103 Group: Platform_Identification Platform_Category: Space Stations/Manned Spacecraft Platform_Series_or_Entity: SPACE SHUTTLE Short_Name: OV-103 Long_Name: Discovery Space Shuttle End_Group Group: Synonymous_Platform_Names Short_Name: Discovery End_Group Creation_Date: 2008-01-25 Online_Resource: http://science.ksc.nasa.gov/shuttle/resources/orbiters/discovery.html Sample_Image: http://science.ksc.nasa.gov/shuttle/resources/orbiters/discovery-logo.gif Group: Platform_Logistics Launch_Date: 1984-08-30 Primary_Sponsor: NASA End_Group End_Group
in scheme: platforms

Space Shuttle
type: Concept