SURFACE RADIATIVE PROPERTIES
type: Concept

REFLECTANCE
type: Concept
change note: 2013-08-16 09:37:27.0 [tbs1979] update Definition (The ratio of reflected radiation to that of the incident radiation on a surface.); update Definition (Glossary of Remote Sensing Terms, Natural Resources Canada);
in scheme: sciencekeywords
definition: The ratio of reflected radiation to that of the incident radiation on a surface.