NON-GOVERNMENT/NON-PROFIT ORGANIZATIONS
type: Concept

QPAIS
type: Concept
in scheme: providers
definition: The Nuclear Industry Association is the trade association and information body for the UK civil nuclear industry, representing over 130 companies. The range of member companies continues to grow and includes companies involved in most business sectors of the UK civil nuclear industry. The mix of services and products offered by members is extensive and spans the entirety of the supply chain. Summary Provided By: http://www.niauk.org/who-we-are.html