CAMS
type: Concept
change note: 2020-04-14 12:43:02.0 [tstevens] insert AltLabel (id: null category: primary text: Compact Atmospheric Multispecies Spectrometer language code: en); insert Definition (id: null text: The CAMS instrument’s core design and operation is similar to the DFGAS (Difference Frequency Generation Absorption Spectrometer) instrument, which has been successfully deployed for fast, accurate, and sensitive airborne measurements of the important trace gas formaldehyde (CH2O). CAMS like DFGAS is based on tunable mid-IR (3.53-μm) absorption spectroscopyutilizing advanced fiber optically pumped difference-frequency generation(DFG) laser sources. A comprehensive discussion of the measurement principle and performance of the DFGAS instrument is found in Weibring et al. [2006, 2007], and only a brief discussion is presented here. language code: en);
change note: 2020-04-14 12:42:06.0 [tstevens] Insert Concept add broader relation (CAMS [f05736cc-2cac-4df5-8e03-cd572f8f1197,559921] - Spectrometers [055a79c7-61db-4250-abad-f1e09909f14c,543071]);
in scheme: instruments
definition: The CAMS instrument’s core design and operation is similar to the DFGAS (Difference Frequency Generation Absorption Spectrometer) instrument, which has been successfully deployed for fast, accurate, and sensitive airborne measurements of the important trace gas formaldehyde (CH2O). CAMS like DFGAS is based on tunable mid-IR (3.53-μm) absorption spectroscopyutilizing advanced fiber optically pumped difference-frequency generation(DFG) laser sources. A comprehensive discussion of the measurement principle and performance of the DFGAS instrument is found in Weibring et al. [2006, 2007], and only a brief discussion is presented here.

Spectrometers
type: Concept