LIFTED INDEX (LI)
type: Concept
change note: 2017-07-14 16:02:13.0 [sritz] Insert Concept add broader relation (LIFTED INDEX (LI) [f07365c3-a36e-4a28-8364-be3941fae000,309817] - Stability/Severe Weather Indices [7844ae66-f542-442f-8359-05014bc19831,309797]);
in scheme: sciencekeywords
definition: Lifted Index = in units of degrees Celsius (°C) provides estimations of the atmospheric stability in cloud-free areas.

Stability/Severe Weather Indices
type: Concept