LSU/LMNH/NATSCI
type: Concept
in scheme: providers
definition: In 1999, the sixteen natural history collections at Louisiana State University in Baton Rouge were designated by the state legislature as the "Louisiana Museum of Natural History." Together, these collections hold a total of more than 2.8 million specimens, objects, and artifacts that document the rich natural history of our state. These collections are dispersed among six independently administered units on campus, and include the Vascular Plant Herbarium, the Mycological Herbarium, the Lichen Herbarium (more information on these three collections can be found by following the LSU Herbarium link above), the Louisiana State Arthropod Museum, the Palynology Collection, the Mineralogy and Petrology Collections, the Textile and Costume Museum, the Louisiana Geological Survey Log Library and Core Repository, and, within the LSU Museum of Natural Science, the Collection of Amphibians and Reptiles, the Collection of Birds, the Collection of Fishes, the Collection of Genetic Resources, the Collection of Mammals, the Vertebrate Paleontology Collection, the Collection of Microfossils and Invertebrates, and the Anthropological and Ethnological Collections. Summary Provided By: http://appl003.lsu.edu/natsci/lmnh.nsf/$Content/History?OpenDocument

ACADEMIC
type: Concept