ATLANTIC MERIDIONAL MODE
type: Concept
definition: The mode describes the meridional variabilty in the tropical Atlantic Ocean. Calculation Method: The AMM spatial pattern is defined via applying Maximum Covariance Analysis (MCA) to sea surface temperature (SST; left field) and the zonal and meridional components of the 10m wind field (right field) over the time period 1950-2005, from the NCEP/NCAR Reanalysis. To define the spatial pattern, data are defined over the region (21S-32N, 74W-15E), and spatially smoothed (three longitude by two latitude points). The seasonal cycle is removed, data are detrended, a three-month running mean is applied to the data, and the linear fit to the Cold Tongue Index (a measure of ENSO variability) is subtracted from each spatial point. Spatial patterns are defined as the first left (SST) and right (winds) maps resulting from singular value decomposition of the covariance matrix between the two fields. The AMM time series below is calculated via projecting SST or the 10m wind field (detrended, CTI removed, but no 3-month running mean) onto the spatial structure resulting from the MCA above. Time Interval: Monthly Time Coverage: 1948 to present
change note: 2020-02-14 14:12:57.0 [tstevens] Remove Concepts delete narrower relation (null);
change note: 2012-06-25 11:49:30.0 [mpmorahan] Insert Concept add broader relation (ATLANTIC MERIDIONAL MODE [f141c968-94d4-4c42-8877-bbe34bb84b26,39727] - TELECONNECTIONS [b887d3e5-4280-43d2-a34e-0f63ac086b6a,20219]);
change note: 2012-06-25 11:49:52.0 [mpmorahan] Insert Concept add narrower relation (ATLANTIC MERIDIONAL MODE [f141c968-94d4-4c42-8877-bbe34bb84b26,39727] - AMM [ddcc55bd-2047-4aa2-996c-409f940fbba9,39729]);
change note: 2012-07-06 13:20:11.0 [mpmorahan] insert Definition (id: null text: The mode describes the meridional variabilty in the tropical Atlantic Ocean. Calculation Method: The AMM spatial pattern is defined via applying Maximum Covariance Analysis (MCA) to sea surface temperature (SST; left field) and the zonal and meridional components of the 10m wind field (right field) over the time period 1950-2005, from the NCEP/NCAR Reanalysis. To define the spatial pattern, data are defined over the region (21S-32N, 74W-15E), and spatially smoothed (three longitude by two latitude points). The seasonal cycle is removed, data are detrended, a three-month running mean is applied to the data, and the linear fit to the Cold Tongue Index (a measure of ENSO variability) is subtracted from each spatial point. Spatial patterns are defined as the first left (SST) and right (winds) maps resulting from singular value decomposition of the covariance matrix between the two fields. The AMM time series below is calculated via projecting SST or the 10m wind field (detrended, CTI removed, but no 3-month running mean) onto the spatial structure resulting from the MCA above. Time Interval: Monthly Time Coverage: 1948 to present language code: en);
in scheme: sciencekeywords

TELECONNECTIONS
type: Concept