NON-GOVERNMENT/NON-PROFIT ORGANIZATIONS
type: Concept

CVI
type: Concept
in scheme: providers
definition: Canaan Valley Institute (CVI) is a nonprofit, non-advocacy organization committed to helping communities improve the quality of life in their watersheds by restoring aquatic resources using cost-effective, locally determined solutions. Summary Provided By: http://www.canaanvi.org/canaanvi_web/index.aspx