WATER QUALITY
type: Concept

OCEAN CONTAMINANTS
type: Concept
in scheme: sciencekeywords
definition: Intrusion of or contact with undesirable elements from an outside source that affect the water quality of the ocean.