Current/Wind Meters
type: Concept

PTGA
type: Concept
in scheme: instruments
definition: The Propeller Type Generating Anemovane is an instrument with a helicoids-shaped, four-blade propeller that measure wind speed and direction.