Sentinel-2B
type: Concept
change note: 2020-02-12 11:40:48.0 [sritz] Move Concepts delete broader relation (null); add broader relation (SENTINEL-2B [f2445400-1981-4ef3-bf7c-f4aa35923ae9,559803] - SENTINEL-2 [2ce20983-98b2-40b9-bb0e-a08074fb93b3,541455]);
change note: 2021-01-13 16:07:06.0 [sritz] insert AltLabel (id: null category: primary text: Sentinel-2B language code: en); update PrefLabel (Sentinel-2B);
change note: 2020-01-30 11:00:22.0 [tstevens] Move Concepts delete broader relation (null); add broader relation (SENTINEL-2B [f2445400-1981-4ef3-bf7c-f4aa35923ae9,559803] - SENTINEL-2 [6f1c359b-b1a6-47c1-979e-0689e637fbdc,559807]);
change note: 2020-01-29 07:34:29.0 [tstevens] Insert Concept add broader relation (SENTINEL-2B [f2445400-1981-4ef3-bf7c-f4aa35923ae9,559803] - Earth Observation Satellites [3466eed1-2fbb-49bf-ab0b-dc08731d502b,541501]);
change note: 2020-01-29 07:35:57.0 [tstevens] insert Definition (id: null text: The Sentinel-2 mission is a land monitoring constellation of two satellites that provide high resolution optical imagery and provide continuity for the current SPOT and Landsat missions. The orbit is an average height of 785 km and the presence of two satellites in the mission allow repeated surveys every 5 days at the equator and every 2-3 days at middle latitudes. The satellites are equipped with the state-of-the-art MSI (Multispectral Imager) instrument for surveying with a resolution of 10 to 60 m in the visible, near infrared (VNIR), and short-wave infrared (SWIR) spectral zones, including 13 spectral channels, which ensures the capture of differences in vegetation state, including temporal changes, and also minimizes impact on the quality of atmospheric photography. Sentinel-2B was launched March 7, 2017. language code: en);
definition: The Sentinel-2 mission is a land monitoring constellation of two satellites that provide high resolution optical imagery and provide continuity for the current SPOT and Landsat missions. The orbit is an average height of 785 km and the presence of two satellites in the mission allow repeated surveys every 5 days at the equator and every 2-3 days at middle latitudes. The satellites are equipped with the state-of-the-art MSI (Multispectral Imager) instrument for surveying with a resolution of 10 to 60 m in the visible, near infrared (VNIR), and short-wave infrared (SWIR) spectral zones, including 13 spectral channels, which ensures the capture of differences in vegetation state, including temporal changes, and also minimizes impact on the quality of atmospheric photography. Sentinel-2B was launched March 7, 2017.
in scheme: platforms

Sentinel-2
type: Concept