NON-GOVERNMENT/NON-PROFIT ORGANIZATIONS
type: Concept

ETI
type: Concept
in scheme: providers
definition: The Expert Center for Taxonomic Identification (ETI) is a non-governmental organisation (NGO) in operational relations with UNESCO. Our mission is to develop and produce scientific and educational computer-aided information systems, to improve the general access to and promote the broad use of taxonomic and biodiversity knowledge worldwide. Website: "http://www.eti.uva.nl/" [Summary provided by ETI.]