USDA
type: Concept

USDA/FS
type: Concept
change note: 2022-09-26 12:11:40.0 [sritz] update Definition (The Forest Service was established in 1905 and is an agency of the U.S. Department of Agriculture. The Forest Service manages public lands in national forests and grasslands, which encompass 193 million acres. Summary provided by: https://www.fs.usda.gov/); update Definition (https://www.fs.usda.gov/); update Resource (provider); update Resource (https://www.fs.usda.gov/);
in scheme: providers
definition: The Forest Service was established in 1905 and is an agency of the U.S. Department of Agriculture. The Forest Service manages public lands in national forests and grasslands, which encompass 193 million acres. Summary provided by: https://www.fs.usda.gov/