JHU/APL/WOOD
type: Concept
in scheme: providers
definition: The Virtual Journal for Biomedical Optics (ISSN: 1931-1532) consists of selected articles recently published in OSA's peer-reviewed journals, plus content published in the Society for Applied Spectroscopy's Applied Spectroscopy journal. For the virtual journal, biomedical optics is considered to include research involving the interface between light and medicine or biology. Articles are selected by the editor, Dr. Gregory W. Faris, on the basis of relevancy using OCIS codes and abstract keywords. Summary Provided by: http://vjbo.osa.org/journal/VJBO/about.cfm

ACADEMIC
type: Concept