SCR-HF
type: Concept
in scheme: instruments
definition: Operating in the HF band of the electromagnetic spectrum, a long range RADAR remotely senses surface currents up to 100 miles offshore.

Radar Sounders
type: Concept