OH-U/COM
type: Concept
in scheme: providers
definition: The mission of the College of Osteopathic Medicine at Ohio University is to educate students to become physicians practicing osteopathic medicine in service to the region, the state, and beyond. Integral to that mission, OU-COM commits itself to: -generating and disseminating new knowledge and understanding through research and scholarly activities; -serving the health needs of people within the Appalachian region; -embracing diversity and public service, with integrity and respect for those served; and -emphasizing primary care and improving the well-being of underserved populations. Website: "http://www.oucom.ohiou.edu/" [Summary provided by Ohio University.]

ACADEMIC
type: Concept