Airstat
type: Concept
change note: 2013-02-21 13:07:14.0 [tbs1979] Insert Concept add broader relation (Airstat [f3684796-d348-44a9-bd97-62f1a329fc83,82675] - CONSORTIA/INSTITUTIONS [aef2fc80-def0-46a4-9259-9dc37e80ed08,66451]);
in scheme: providers
definition: Airstat is a service that provides a free, daily air quality alert for your city.

CONSORTIA/INSTITUTIONS
type: Concept