COA/GISLAB
type: Concept
in scheme: providers
definition: The Geographic Information Systems Laboratory at College of the Atlantic provides GIS projects, analysis and visualization services to the local and global community. Website: "http://www.coa.edu/gislab/"

ACADEMIC
type: Concept