ACADEMIC
type: Concept

UNIVPM/IBG
type: Concept
in scheme: providers
definition: Although elasmobranchs are widely distributed species, commonly found on sandy, gravely or muddy bottoms, several biological aspects of their metabolism still remain poorly investigated. In this work the efficiency of antioxidant system and detoxification enzymes were investigated in the coastal spotted dogfish Scyliorhinus canicula and in the red mullet Mullus barbatus for comparison with a teleost species. Organisms were sampled during a bottom trawl survey and analyzed for the biotransformation activity (EROD), levels of metallothioneins, catalase, glutathione S-transferases and total oxyradical scavenging capacity (TOSC) toward peroxyl radicals and hydroxyl radicals. EROD activity in the elasmobranchs was more than one order of magnitude lower than in the red mullets, while similar levels of metallothioneins were measured in these species. S. canicula showed significantly lower antioxidant enzymes and a more reduced efficiency in neutralizing [Formula: see text] OH; on the other hand the scavenging capability toward ROO [Formula: see text] was comparable in S. canicula and M. barbatus.