JP/JAXA/EORC/GLACE
type: Concept
in scheme: providers
definition: On October 1, 2003, the Institute of Space and Astronautical Science (ISAS), the National Aerospace Laboratory of Japan (NAL) and the National Space Development Agency of Japan (NASDA) were merged into one independent administrative institution to be able to perform all their activities in the aerospace field as one organization, from basic research and development to utilization. The independent administrative institution is the Japan Aerospace Exploration Agency (JAXA.). As space development and utilization, and aviation research and development are steps to achieve the nation's policy objectives, our contribution to problem solving is an important mission for us. JAXA proposed its long-term vision, "JAXA2025," to realize our own mission. Under our corporate message "Reaching for the skies, exploring space," JAXA is pursuing great possibilities in various aerospace fields and is striving to succeed with various research and development missions in order to contribute to the peace and happiness of humankind. Summary provided by http://www.jaxa.jp/about/index_e.html

JAPAN
type: Concept