TEMPERATURE GRADIENT
type: Concept

TEMPERATURE GRADIENT RATE
type: Concept
change note: 2013-03-11 15:39:58.0 [tbs1979] insert Definition (id: null text: The rate at which temperature changes at a particular location as it relates to geothermal energy. language code: en);
change note: 2013-03-05 09:50:04.0 [tbs1979] Insert Concept add broader relation (TEMPERATURE GRADIENT RATE [f4573e47-3cce-49ec-98d3-b5b3bb51371e,82903] - TEMPERATURE GRADIENT [99d567bb-7767-4ea4-a135-a611eac6a669,82897]);
in scheme: sciencekeywords
definition: The rate at which temperature changes at a particular location as it relates to geothermal energy.