ESSPO
type: Concept
in scheme: projects
definition: [Source: Bob Dattore, NCAR] 433L is the nickname for the U.S. Air Force Weather Observing and Forecasting System. It was their first computerized operational model. ESSPO was a joint program of the FAA, Department of Defense, and Department of Commerce. It stands for Electronic Support System Project Office.

D - F
type: Concept