SURFACE TEMPERATURE
type: Concept

AIR TEMPERATURE
type: Concept
change note: 2015-03-04 17:06:48.0 [saritz] Move Concepts delete broader relation (null); add broader relation (AIR TEMPERATURE [f634ab55-de40-4d0b-93bc-691bf5408ccb,85689] - SURFACE TEMPERATURE [5a7bb095-4d12-4232-bc75-b8e82197cb92,86389]);
change note: 2013-10-11 17:02:54.0 [saritz] Updated definition. update Definition (The temperature indicated by a thermometer exposed to the air in a place sheltered from direct solar radiation.); update Definition (Glossary of Meteorology, American Meteorological Society, 2012.);
in scheme: sciencekeywords
definition: The temperature indicated by a thermometer exposed to the air in a place sheltered from direct solar radiation.