ENTRAINMENT
type: Concept
change note: 2017-03-10 08:49:10.0 [tstevens] update Definition (The process of picking up and carrying along, as the collecting and movement of sediment by currents.); update Definition (Dictionary of Geological Terms, American Geological Institute, 1984. );
in scheme: sciencekeywords
definition: The process of picking up and carrying along, as the collecting and movement of sediment by currents.

EROSION/SEDIMENTATION
type: Concept