TUYA
type: Concept
change note: 2013-08-16 10:26:54.0 [tbs1979] insert Definition (id: null text: A type of distinctive, flat-topped, steep-sided volcano formed when lava erupts through a thick glacier or ice sheet. They are somewhat rare worldwide, being confined to regions which were formerly covered by continental ice sheets and also had active volcanism during the same time period. language code: en);
change note: 2013-08-05 13:56:19.0 [tbs1979] Insert Concept add broader relation (TUYA [f8a9104b-fe7b-4a60-94fc-6b5ef504db55,105393] - TECTONIC LANDFORMS [9673dc0b-89c0-4f0c-b378-f1c8cb267c8f,105291]);
in scheme: sciencekeywords
definition: A type of distinctive, flat-topped, steep-sided volcano formed when lava erupts through a thick glacier or ice sheet. They are somewhat rare worldwide, being confined to regions which were formerly covered by continental ice sheets and also had active volcanism during the same time period.

TECTONIC LANDFORMS
type: Concept