SAVANNAS
type: Concept
change note: 2016-07-12 10:31:26.0 [gee-cee] update Definition (An open, grassy, essentially treeless plain, especially as developed in tropical or subtropical regions.); update Definition (Dictionary of Geological Terms, American Geological Institute, 1984. );
in scheme: sciencekeywords
definition: An open, grassy, essentially treeless plain, especially as developed in tropical or subtropical regions.

TERRESTRIAL ECOSYSTEMS
type: Concept