SOLO-II
type: Concept
change note: 2022-10-12 07:44:33.0 [tstevens] insert AltLabel (id: null category: primary text: Sounding Oceanographic Lagrangian Observer-II language code: en); insert Definition (id: null text: Deployment of Deep Argo regional pilot arrays is underway as a step toward a global array of 1250 surface-to-bottom profiling floats embedded in the upper-ocean (2000 m) Argo Program. Of the 80 active Deep Argo floats as of July 2019, 55 are Deep Sounding Oceanographic Lagrangian Observer (SOLO) 6000-m instruments, and the rest are composed of three additional models profiling to either 4000 or 6000 m. Early success of the Deep SOLO is owed partly to its evolution from the Core Argo SOLO-II. Here, Deep SOLO design choices are described, including the spherical glass pressure housing, the hydraulics system, and the passive bottom detection system. Operation of Deep SOLO is flexible, with the mission parameters being adjustable from shore via Iridium communications. Long lifetime is a key element in sustaining a global array, and Deep SOLO combines a long battery life of over 200 cycles to 6000 m with robust operation and a low failure rate. The scientific value of Deep SOLO is illustrated, including examples of its ability (i) to observe large-scale spatial and temporal variability in deep ocean temperature and salinity, (ii) to sample newly formed water masses year-round and within a few meters of the sea floor, and (iii) to explore the poorly known abyssal velocity field and deep circulation of the World Ocean. Deep SOLO’s full-depth range and its potential for global coverage are critical attributes for complementing the Core Argo Program and achieving these objectives. language code: en);
change note: 2022-10-12 07:43:21.0 [tstevens] Insert Concept add broader relation (SOLO-II [f93f4587-4216-42d1-ae0a-66fef79bdd1a,1084899] - Profilers/Sounders [ffa3a835-903a-462a-adfb-fc0d25ba07d0,1077446]);
in scheme: instruments
definition: Deployment of Deep Argo regional pilot arrays is underway as a step toward a global array of 1250 surface-to-bottom profiling floats embedded in the upper-ocean (2000 m) Argo Program. Of the 80 active Deep Argo floats as of July 2019, 55 are Deep Sounding Oceanographic Lagrangian Observer (SOLO) 6000-m instruments, and the rest are composed of three additional models profiling to either 4000 or 6000 m. Early success of the Deep SOLO is owed partly to its evolution from the Core Argo SOLO-II. Here, Deep SOLO design choices are described, including the spherical glass pressure housing, the hydraulics system, and the passive bottom detection system. Operation of Deep SOLO is flexible, with the mission parameters being adjustable from shore via Iridium communications. Long lifetime is a key element in sustaining a global array, and Deep SOLO combines a long battery life of over 200 cycles to 6000 m with robust operation and a low failure rate. The scientific value of Deep SOLO is illustrated, including examples of its ability (i) to observe large-scale spatial and temporal variability in deep ocean temperature and salinity, (ii) to sample newly formed water masses year-round and within a few meters of the sea floor, and (iii) to explore the poorly known abyssal velocity field and deep circulation of the World Ocean. Deep SOLO’s full-depth range and its potential for global coverage are critical attributes for complementing the Core Argo Program and achieving these objectives.

Profilers/Sounders
type: Concept