ALADIN
type: Concept
definition: Direct Detection Doppler Lidar (D3L) operating in the ultra-violet spectral region (355 nm). The instrument measures both Mie scattering from particles and aerosols and Rayleigh scattering from the upper atmosphere
change note: 2018-07-04 08:06:42.0 [mmorahan] insert Definition (id: null text: Direct Detection Doppler Lidar (D3L) operating in the ultra-violet spectral region (355 nm). The instrument measures both Mie scattering from particles and aerosols and Rayleigh scattering from the upper atmosphere language code: en);
change note: 2020-07-15 09:41:53.0 [mmorahan] insert AltLabel (id: null category: primary text: Atmospheric Laser Doppler Instrument language code: en);
change note: 2018-07-04 07:57:18.0 [mmorahan] Insert Concept add broader relation (ALADIN [f94386e2-8e9b-4a95-9071-fb617a50cabb,367731] - Lidar/Laser Sounders [7c13f166-8711-4d2f-9251-4635002c6c31,347731]);
change note: 2019-02-11 14:50:51.0 [mmorahan] insert WeightedRelation (id: null related concept uuid: e31c4750-9903-4de7-95ef-faa9610f3a63 relationship type: null relationship value: null generated by: null);
in scheme: instruments

Lidar/Laser Sounders
type: Concept