ANIMAL PHYSIOLOGY AND BIOCHEMISTRY
type: Concept
in scheme: sciencekeywords
definition: Any measure related to the function of an animal's body and its organs, systems, tissues, cells, and chemistry.

ANIMAL SCIENCE
type: Concept