TAM-CGPS
type: Concept
in scheme: projects
definition: OPP-0230285/OPP-0230356 PIs: Wilson, Terry J./Hothem, Larry D. This award, provided by the Antarctic Geology and Geophysics Program of the Office of Polar Programs, supports a project to conduct GPS measurements of bedrock crustal motions in an extended Transantarctic Mountains Deformation network (TAMDEF) to document neotectonic displacements due to tectonic deformation within the West Antarctic rift and/or to mass change of the Antarctic ice sheets. Horizontal displacements related to active neotectonic rifting, strike-slip translations, and volcanism will be tightly constrained by monitoring the combined TAMDEF and Italian VLNDEF networks of bedrock GPS stations along the Transantarctic Mountains and on offshore islands in the Ross Sea. Summary Provided By: http://www.sciencestorm.com/award/0230356.html

S - U
type: Concept