DOI/USGS/BRD/LSC/NARL
type: Concept
change note: 2014-03-26 15:19:44.0 [epneff] updated website url update Definition (The Northern Appalachian Research Laboratory (NARL) > is a designated aquatic biology research station of the US Geological Survey. The staff consists of approximately 20 people. NARL is specialized in programs of ecology, conservation technology, genetics, and environmental chemistry and they also emphasize the integration of laboratory and field studies. Current Research?s include the Fisheries and Aquatic Resources, Endangered and At-risk Species, Invasive Specie, Biological Information Management and Delivery. Website: "http://www.lsc.usgs.gov/?q=northern-appalachian-research-branch" [Summary provided by the USGS.]);
in scheme: providers
definition: The Northern Appalachian Research Laboratory (NARL) > is a designated aquatic biology research station of the US Geological Survey. The staff consists of approximately 20 people. NARL is specialized in programs of ecology, conservation technology, genetics, and environmental chemistry and they also emphasize the integration of laboratory and field studies. Current Research?s include the Fisheries and Aquatic Resources, Endangered and At-risk Species, Invasive Specie, Biological Information Management and Delivery. Website: "http://www.lsc.usgs.gov/?q=northern-appalachian-research-branch" [Summary provided by the USGS.]

USGS
type: Concept