PERIGLACIAL PROCESSES
type: Concept
change note: 2013-04-01 11:19:28.0 [tbs1979] insert Definition (id: null text: Describes a geomorphic process related to freezing of water occur. In its original meaning a periglacial area was at the time in question, the area was not buried by glacial ice but was subject to intense freezing cycles and exhibits permafrost weathering and erosion characteristics. language code: en);
change note: 2013-03-05 09:03:40.0 [tbs1979] Insert Concept add broader relation (PERIGLACIAL PROCESSES [fa0f38f3-2faa-4cd7-a848-22f3d96ab210,82821] - GLACIAL PROCESSES [d7b62912-5970-46b1-be45-6a603c9a6979,82723]);
in scheme: sciencekeywords
definition: Describes a geomorphic process related to freezing of water occur. In its original meaning a periglacial area was at the time in question, the area was not buried by glacial ice but was subject to intense freezing cycles and exhibits permafrost weathering and erosion characteristics.

GLACIAL PROCESSES
type: Concept