DataONE
type: Concept
change note: 2012-08-16 13:00:38.0 [tbs1979] Insert Concept add broader relation (DataONE [fa6f6c07-7c04-4374-b9a8-3ac0f236f743,40519] - CONSORTIA/INSTITUTIONS [aef2fc80-def0-46a4-9259-9dc37e80ed08,24341]);
in scheme: providers
definition: Data Observation Network for Earth (DataONE) is the foundation of new innovative environmental science through a distributed framework and sustainable cyberinfrastructure that meets the needs of science and society for open, persistent, robust, and secure access to well-described and easily discovered Earth observational data. Supported by the U.S. National Science Foundation (Grant #OCI-0830944) as one of the initial DataNets, DataONE will ensure the preservation, access, use and reuse of multi-scale, multi-discipline, and multi-national science data via three principle cyberinfrastucture elements and a broad education and outreach program.

CONSORTIA/INSTITUTIONS
type: Concept