SEA SURFACE TEMPERATURE RECONSTRUCTION
type: Concept
change note: 2012-07-26 11:49:02.0 [mpmorahan] insert Definition (id: null text: Reconstruction of past sea surface temperatures (SST) based on paleoclimate proxy records. language code: en);
change note: 2012-06-27 08:47:33.0 [mpmorahan] Insert Concept add broader relation (SEA SURFACE TEMPERATURE RECONSTRUCTION [facdb262-04eb-47f9-b46e-ba7a379722ec,40165] - PALEOCLIMATE RECONSTRUCTIONS [6f6423e8-ab4e-4572-8982-d9c40f64e28b,40149]);
in scheme: sciencekeywords
definition: Reconstruction of past sea surface temperatures (SST) based on paleoclimate proxy records.

PALEOCLIMATE RECONSTRUCTIONS
type: Concept