SOIL TEXTURE
type: Concept
change note: 2017-03-10 09:24:33.0 [tstevens] update Definition (The relative proportions of the various soil separates in a soil, as described by the percent clay, sand, and silt.); update Definition (Glossary of Soil Science Terms "http://www.soils.org/sssagloss/browse.html" );
in scheme: sciencekeywords
definition: The relative proportions of the various soil separates in a soil, as described by the percent clay, sand, and silt.

SOILS
type: Concept