EMS-I
type: Concept
in scheme: providers
definition: EMS-I is the head distributor of software, support, training, and consulting services for water resources modeling using the Groundwater Modeling System (GMS Software), Surface-water Modeling System (SMS Software), and Watershed Modeling System (WMS Software). Summary provided by http://www.ems-i.com/

COMMERCIAL
type: Concept