UNIPD/BIOLOGIA
type: Concept
in scheme: providers
definition: The Department of Biology was established in October 1983 as a result of the merger of the Departments of Animal Biology of Botany and Anthropology at the University of Padua, of 'Orto Botanico di Padova and Marine Biology Station of Chioggia (Venice ).

ACADEMIC
type: Concept