METALS
type: Concept

METALS VERTICAL/GEOGRAPHIC DISTRIBUTION
type: Concept
change note: 2013-03-13 14:54:50.0 [tbs1979] insert Definition (id: null text: The vertical and geographic distribution of metals within the solid Earth. language code: en);
change note: 2013-03-07 08:33:41.0 [tbs1979] Insert Concept add broader relation (METALS VERTICAL/GEOGRAPHIC DISTRIBUTION [fbc418a0-5d32-43ab-9f1f-e81b9d8534e1,83139] - METALS [7b76bca5-32ee-4285-8550-0de120b01a13,63021]);
in scheme: sciencekeywords
definition: The vertical and geographic distribution of metals within the solid Earth.